litestream · Issues· 147 open
Open on GitHubLocally synced open issues (discussions stay on GitHub)
- #1151
Failed upload breaks compaction
bugstaleUpdated Sep 18, 2026 - #1529
Support for S3 Express One Zone (directory buckets)?
enhancementUpdated Sep 18, 2026 - #1527
Nightly stability failure: 2026-09-15T03:02:52.6966674Z --- FAIL: TestMinIOSoak (1.19s)
bugstabilityUpdated Sep 15, 2026 - #1523
replica_url: provider detection fails when the endpoint includes an explicit port
bugUpdated Sep 14, 2026 - #1522
Nightly stability failure: 2026-09-14T03:02:40.5462163Z --- FAIL: TestMinIOSoak (0.60s); 2026-09-14T03:03:05.3830486Z…
bugstabilityUpdated Sep 14, 2026 - #1521
Nightly stability failure: Malformed job record #7: steps[5].conclusion must be a non-empty string; steps[6].conclusi…
bugstabilityUpdated Sep 12, 2026 - #1309
Restored DB fails integrity_check when the initial snapshot build is slow relative to write activity (0.5.12, GCS replica)
staleUpdated Sep 11, 2026 - #1515
`restore -f` stops making progress permanently and logs nothing when it cannot bridge a gap
Updated Sep 10, 2026 - #1441
Nightly stability failure: 2026-09-10T03:03:34.0098584Z --- FAIL: TestResumableReader_ContextCancelAbortsBackoff (0.0
bugstabilityUpdated Sep 10, 2026 - #1400
Thoughts from a first-time user
Updated Sep 6, 2026 - #1513
Writable VFS: scope write state by database name
Updated Sep 5, 2026 - #1512
GCS replica writes hang indefinitely on v0.5.16/v0.5.17 during a v0.3.x → v0.5.x migration (works fine on v0.3.13)
bugUpdated Sep 5, 2026 - #1511
Nightly stability failure: Malformed job record #4: steps[5].conclusion must be a non-empty string; steps[6].conclusi…
bugstabilityUpdated Sep 5, 2026 - #1510
Compaction from L0 snapshot writes DB-sized LTX's across all levels
bugUpdated Sep 4, 2026 - #1508
Sync() can decode O(db-size) bytes, delaying checkpoints after large L0 snapshot
bugUpdated Sep 4, 2026